Reaction Details
TargetC-C chemokine receptor type 5
LigandBDBM50119349
Substrate/Competitorn/a
Meas. Tech.ChEMBL_39511 (CHEMBL654808)
IC50 0.1±n/a nM
Citation Lynch, CLHale, JJBudhu, RJGentry, ALMills, SGChapman, KTMacCoss, MMalkowitz, LSpringer, MSGould, SLDeMartino, JASiciliano, SJCascieri, MACarella, ACarver, GHolmes, KSchleif, WADanzeisen, RHazuda, DKessler, JLineberger, JMiller, MEmini, EA 1,3,4-Trisubstituted pyrrolidine CCR5 receptor antagonists. Part 4: synthesis of N-1 acidic functionality affording analogues with enhanced antiviral activity against HIV. Bioorg Med Chem Lett12:3001-4 (2002) C-C chemokine receptor type 5
Name:C-C chemokine receptor type 5
Type:Enzyme
Mol. Mass.:40540.21
Organism:Homo sapiens (Human)
Description:P51681
Residue:352
BDBM50119349
NameBDBM50119349
Synonyms:(R)-2-cyclobutyl-2-((3S,4S)-3-phenyl-4-((4-(3-phenylpropyl)piperidin-1-yl)methyl)pyrrolidin-1-yl)acetic acid CHEMBL320386
TypeSmall organic molecule
Emp. Form.C31H42N2O2
Mol. Mass.474.6774
SMILESOC(=O)[C@@H](C1CCC1)N1C[C@H](CN2CCC(CCCc3ccccc3)CC2)[C@H](C1)c1ccccc1