Reaction Details
TargetProthrombin
LigandBDBM50127494
Substrate/Competitorn/a
Meas. Tech.ChEMBL_208505 (CHEMBL811978)
Ki 140000±n/a nM
Citation Sagi, KNakagawa, TYamanashi, MMakino, STakahashi, MTakayanagi, MTakenaka, KSuzuki, NOono, SKataoka, NIshikawa, KShima, SFukuda, YKayahara, TTakehana, SShima, YTashiro, KYamamoto, HYoshimoto, RIwata, STsuji, TSakurai, KShoji, M Rational design, synthesis, and structure-activity relationships of novel factor Xa inhibitors: (2-substituted-4-amidinophenyl)pyruvic and -propionic acids. J Med Chem46:1845-57 (2003) 
 
Prothrombin
Name:Prothrombin
Type:Protein
Mol. Mass.:70029.57
Organism:Homo sapiens (Human)
Description:P00734
Residue:622
BDBM50127494
NameBDBM50127494
Synonyms:3-(4-Carbamimidoyl-2-{2-[(3,4,5,6-tetrahydro-2H-[1,4']bipyridinyl-4-carbonyl)-amino]-ethoxy}-phenyl)-2-oxo-propionic acid | CHEMBL55500
TypeSmall organic molecule
Emp. Form.C23H27N5O5
Mol. Mass.453.491
SMILESNC(=N)c1ccc(CC(=O)C(O)=O)c(OCCNC(=O)C2CCN(CC2)c2ccncc2)c1