Reaction Details
TargetCoagulation factor X
LigandBDBM50127503
Substrate/Competitorn/a
Meas. Tech.ChEMBL_48812 (CHEMBL662835)
Ki 28±n/a nM
Citation Sagi, KNakagawa, TYamanashi, MMakino, STakahashi, MTakayanagi, MTakenaka, KSuzuki, NOono, SKataoka, NIshikawa, KShima, SFukuda, YKayahara, TTakehana, SShima, YTashiro, KYamamoto, HYoshimoto, RIwata, STsuji, TSakurai, KShoji, M Rational design, synthesis, and structure-activity relationships of novel factor Xa inhibitors: (2-substituted-4-amidinophenyl)pyruvic and -propionic acids. J Med Chem46:1845-57 (2003) 
 
Coagulation factor X
Name:Coagulation factor X
Type:Enzyme
Mol. Mass.:54726.60
Organism:Homo sapiens (Human)
Description:n/a
Residue:488
BDBM50127503
NameBDBM50127503
Synonyms:3-(4-Carbamimidoyl-benzoylamino)-4-(3-carbamimidoyl-phenoxy)-butyric acid | CHEMBL443477
TypeSmall organic molecule
Emp. Form.C19H21N5O4
Mol. Mass.383.4011
SMILESNC(=N)c1ccc(cc1)C(=O)N[C@@H](COc1cccc(c1)C(N)=N)CC(O)=O