Reaction Details
TargetProthrombin
LigandBDBM50127506
Substrate/Competitorn/a
Meas. Tech.ChEMBL_208505 (CHEMBL811978)
Ki>1500000±n/a nM
Citation Sagi, KNakagawa, TYamanashi, MMakino, STakahashi, MTakayanagi, MTakenaka, KSuzuki, NOono, SKataoka, NIshikawa, KShima, SFukuda, YKayahara, TTakehana, SShima, YTashiro, KYamamoto, HYoshimoto, RIwata, STsuji, TSakurai, KShoji, M Rational design, synthesis, and structure-activity relationships of novel factor Xa inhibitors: (2-substituted-4-amidinophenyl)pyruvic and -propionic acids. J Med Chem46:1845-57 (2003) 
 
Prothrombin
Name:Prothrombin
Type:Protein
Mol. Mass.:70029.57
Organism:Homo sapiens (Human)
Description:P00734
Residue:622
BDBM50127506
NameBDBM50127506
Synonyms:3-(4-Carbamimidoyl-benzoylamino)-4-(3-carbamimidoyl-phenoxy)-butyric acid | CHEMBL52350
TypeSmall organic molecule
Emp. Form.C19H21N5O4
Mol. Mass.383.4011
SMILESNC(=N)c1ccc(cc1)C(=O)N[C@H](COc1cccc(c1)C(N)=N)CC(O)=O