Reaction Details
TargetCoagulation factor X
LigandBDBM50127492
Substrate/Competitorn/a
Meas. Tech.ChEMBL_48812 (CHEMBL662835)
Ki 11±n/a nM
Citation Sagi, KNakagawa, TYamanashi, MMakino, STakahashi, MTakayanagi, MTakenaka, KSuzuki, NOono, SKataoka, NIshikawa, KShima, SFukuda, YKayahara, TTakehana, SShima, YTashiro, KYamamoto, HYoshimoto, RIwata, STsuji, TSakurai, KShoji, M Rational design, synthesis, and structure-activity relationships of novel factor Xa inhibitors: (2-substituted-4-amidinophenyl)pyruvic and -propionic acids. J Med Chem46:1845-57 (2003) 
 
Coagulation factor X
Name:Coagulation factor X
Type:Enzyme
Mol. Mass.:54726.60
Organism:Homo sapiens (Human)
Description:n/a
Residue:488
BDBM50127492
NameBDBM50127492
Synonyms:4-[5-Carbamimidoyl-2-(2-carboxy-2-oxo-ethyl)-phenoxy]-3-{4-[1-(1-imino-ethyl)-piperidin-4-yloxy]-benzoylamino}-butyric acid | CHEMBL55237
TypeSmall organic molecule
Emp. Form.C28H33N5O8
Mol. Mass.567.5903
SMILESCC(=N)N1CCC(CC1)Oc1ccc(cc1)C(=O)N[C@@H](COc1cc(ccc1CC(=O)C(O)=O)C(N)=N)CC(O)=O