Reaction Details
TargetCoagulation factor X
LigandBDBM50127505
Substrate/Competitorn/a
Meas. Tech.ChEMBL_48812 (CHEMBL662835)
Ki 2800±n/a nM
Citation Sagi, KNakagawa, TYamanashi, MMakino, STakahashi, MTakayanagi, MTakenaka, KSuzuki, NOono, SKataoka, NIshikawa, KShima, SFukuda, YKayahara, TTakehana, SShima, YTashiro, KYamamoto, HYoshimoto, RIwata, STsuji, TSakurai, KShoji, M Rational design, synthesis, and structure-activity relationships of novel factor Xa inhibitors: (2-substituted-4-amidinophenyl)pyruvic and -propionic acids. J Med Chem46:1845-57 (2003) 
 
Coagulation factor X
Name:Coagulation factor X
Type:Enzyme
Mol. Mass.:54726.60
Organism:Homo sapiens (Human)
Description:n/a
Residue:488
BDBM50127505
NameBDBM50127505
Synonyms:CHEMBL55364 | N-[2-(3-Carbamimidoyl-phenoxy)-ethyl]-benzamide
TypeSmall organic molecule
Emp. Form.C16H17N3O2
Mol. Mass.283.3251
SMILESNC(=N)c1cccc(OCCNC(=O)c2ccccc2)c1