Reaction Details
TargetPotassium voltage-gated channel subfamily H member 2
LigandBDBM50128685
Substrate/Competitorn/a
Meas. Tech.ChEMBL_215102 (CHEMBL820996)
Ki 58400±n/a nM
Citation Friesen, RWDucharme, YBall, RGBlouin, MBoulet, LCôté, BFrenette, RGirard, MGuay, DHuang, ZJones, TRLaliberté, FLynch, JJMancini, JMartins, EMasson, PMuise, EPon, DJSiegl, PKStyhler, ATsou, NNTurner, MJYoung, RNGirard, Y Optimization of a tertiary alcohol series of phosphodiesterase-4 (PDE4) inhibitors: structure-activity relationship related to PDE4 inhibition and human ether-a-go-go related gene potassium channel binding affinity. J Med Chem46:2413-26 (2003) 
 
Potassium voltage-gated channel subfamily H member 2
Name:Potassium voltage-gated channel subfamily H member 2
Type:Multi-pass membrane protein
Mol. Mass.:126672.65
Organism:Homo sapiens (Human)
Description:Q12809
Residue:1159
BDBM50128685
NameBDBM50128685
Synonyms:2-{5-[1-(3-Cyclobutoxy-4-difluoromethoxy-phenyl)-2-(1-oxy-pyridin-4-yl)-ethyl]-thiazol-2-yl}-propan-2-ol | CHEMBL310303
TypeSmall organic molecule
Emp. Form.C24H26F2N2O4S
Mol. Mass.476.536
SMILESCC(C)(O)c1ncc(s1)C(Cc1cc[n+]([O-])cc1)c1ccc(OC(F)F)c(OC2CCC2)c1