Reaction Details
TargetcAMP-specific 3',5'-cyclic phosphodiesterase 4A
LigandBDBM50128692
Substrate/Competitorn/a
Meas. Tech.ChEMBL_70496 (CHEMBL677056)
IC50 0.7±n/a nM
Citation Friesen, RWDucharme, YBall, RGBlouin, MBoulet, LCôté, BFrenette, RGirard, MGuay, DHuang, ZJones, TRLaliberté, FLynch, JJMancini, JMartins, EMasson, PMuise, EPon, DJSiegl, PKStyhler, ATsou, NNTurner, MJYoung, RNGirard, Y Optimization of a tertiary alcohol series of phosphodiesterase-4 (PDE4) inhibitors: structure-activity relationship related to PDE4 inhibition and human ether-a-go-go related gene potassium channel binding affinity. J Med Chem46:2413-26 (2003) 
 
cAMP-specific 3',5'-cyclic phosphodiesterase 4A
Name:cAMP-specific 3',5'-cyclic phosphodiesterase 4A
Type:Enzyme
Mol. Mass.:98113.27
Organism:Homo sapiens (Human)
Description:P27815
Residue:886
BDBM50128692
NameBDBM50128692
Synonyms:5-{2-(3-Cyclopropoxy-4-difluoromethoxy-phenyl)-2-[6-(1-hydroxy-1-methyl-ethyl)-pyridin-3-yl]-ethyl}-3H-pyridin-2-one | CHEMBL81491
TypeSmall organic molecule
Emp. Form.C25H26F2N2O4
Mol. Mass.456.4817
SMILESCC(C)(O)c1ccc(cn1)C(Cc1ccc(=O)[nH]c1)c1ccc(OC(F)F)c(OC2CC2)c1