Reaction Details
TargetPotassium voltage-gated channel subfamily KQT member 2/3
LigandBDBM50130610
Substrate/Competitorn/a
Meas. Tech.ChEMBL_91707 (CHEMBL702365)
EC50 690.0±n/a nM
Citation Wu, YJBoissard, CGGreco, CGribkoff, VKHarden, DGHe, HL'Heureux, AKang, SHKinney, GGKnox, RJNatale, JNewton, AELehtinen-Oboma, SSinz, MWSivarao, DVStarrett, JESun, LQTertyshnikova, SThompson, MWWeaver, DWong, HSZhang, LDworetzky, SI (S)-N-[1-(3-morpholin-4-ylphenyl)ethyl]- 3-phenylacrylamide: an orally bioavailable KCNQ2 opener with significant activity in a cortical spreading depression model of migraine. J Med Chem46:3197-200 (2003) 
 
Potassium voltage-gated channel subfamily KQT member 2/3
Name:Potassium voltage-gated channel subfamily KQT member 2/3
Type:n/a
Mol. Mass.:n/a
Description:ASSAY_ID of EBI is 91707
Components:This complex has 3 components.
Component 1
Name:Potassium voltage-gated channel subfamily KQT member 2
Synonyms:KCNQ (Kv7) potassium channel KCNQ2_HUMAN Neuroblastoma-specific potassium channel subunit alpha KvLQT2 Voltage-gated potassium channel subunit Kv7.2
Type:PROTEIN
Mol. Mass.:95883.20
Organism:Homo sapiens (Human)
Description:ChEMBL_1457496
Residue:872
Component 2
Name:Potassium voltage-gated channel subfamily KQT member 3
Synonyms:KCNQ (Kv7) potassium channel KCNQ3_HUMAN | Voltage-gated potassium channel subunit Kv7.3
Type:PROTEIN
Mol. Mass.:96759.41
Organism:Homo sapiens (Human)
Description:ChEMBL_938652
Residue:872
BDBM50130610
NameBDBM50130610
Synonyms:(E)-N-[(S)-1-(3-Morpholin-4-yl-phenyl)-ethyl]-3-phenyl-acrylamide CHEMBL317935 | N-[1-(3-Morpholin-4-yl-phenyl)-ethyl]-3-phenyl-acrylamide
TypeSmall organic molecule
Emp. Form.C21H24N2O2
Mol. Mass.336.4275
SMILESC[C@H](NC(=O)\C=C\c1ccccc1)c1cccc(c1)N1CCOCC1