Reaction Details
TargetMitogen-activated protein kinase kinase kinase kinase 1
LigandBDBM50569660
Substrate/Competitorn/a
Meas. Tech.ChEMBL_2109901 (CHEMBL4818576)
IC50 0.200000±n/a nM
Citation Vara, BALevi, SMAchab, ACandito, DAFradera, XLesburg, CAKawamura, SLacey, BMLim, JMethot, JLXu, ZXu, HSmith, DMPiesvaux, JAMiller, JRBittinger, MRanganath, SHBennett, DJDiMauro, EFPasternak, A Discovery of Diaminopyrimidine Carboxamide HPK1 Inhibitors as Preclinical Immunotherapy Tool Compounds. ACS Med Chem Lett12:653-661 (2021) 
 
Mitogen-activated protein kinase kinase kinase kinase 1
Name:Mitogen-activated protein kinase kinase kinase kinase 1
Type:PROTEIN
Mol. Mass.:91316.07
Organism:Homo sapiens (Human)
Description:ChEMBL_586597
Residue:833
BDBM50569660
NameBDBM50569660
Synonyms:CHEMBL4849567
TypeSmall organic molecule
Emp. Form.C23H26N6O2
Mol. Mass.418.4915
SMILESCOc1cc2CCN(C)Cc2cc1Nc1ncc(C(N)=O)c(Nc2ccccc2C)n1