Reaction Details
TargetMitogen-activated protein kinase kinase kinase kinase 1
LigandBDBM50569665
Substrate/Competitorn/a
Meas. Tech.ChEMBL_2109901 (CHEMBL4818576)
IC50 0.037000±n/a nM
Citation Vara, BALevi, SMAchab, ACandito, DAFradera, XLesburg, CAKawamura, SLacey, BMLim, JMethot, JLXu, ZXu, HSmith, DMPiesvaux, JAMiller, JRBittinger, MRanganath, SHBennett, DJDiMauro, EFPasternak, A Discovery of Diaminopyrimidine Carboxamide HPK1 Inhibitors as Preclinical Immunotherapy Tool Compounds. ACS Med Chem Lett12:653-661 (2021) 
 
Mitogen-activated protein kinase kinase kinase kinase 1
Name:Mitogen-activated protein kinase kinase kinase kinase 1
Type:PROTEIN
Mol. Mass.:91316.07
Organism:Homo sapiens (Human)
Description:ChEMBL_586597
Residue:833
BDBM50569665
NameBDBM50569665
Synonyms:CHEMBL4864568
TypeSmall organic molecule
Emp. Form.C24H28N6O3
Mol. Mass.448.5175
SMILESCOCc1ccccc1Nc1nc(Nc2cc3CN(C)CCc3cc2OC)ncc1C(N)=O