Reaction Details
TargetMitogen-activated protein kinase kinase kinase kinase 1
LigandBDBM50569666
Substrate/Competitorn/a
Meas. Tech.ChEMBL_2109901 (CHEMBL4818576)
IC50 0.067000±n/a nM
Citation Vara, BALevi, SMAchab, ACandito, DAFradera, XLesburg, CAKawamura, SLacey, BMLim, JMethot, JLXu, ZXu, HSmith, DMPiesvaux, JAMiller, JRBittinger, MRanganath, SHBennett, DJDiMauro, EFPasternak, A Discovery of Diaminopyrimidine Carboxamide HPK1 Inhibitors as Preclinical Immunotherapy Tool Compounds. ACS Med Chem Lett12:653-661 (2021) 
 
Mitogen-activated protein kinase kinase kinase kinase 1
Name:Mitogen-activated protein kinase kinase kinase kinase 1
Type:PROTEIN
Mol. Mass.:91316.07
Organism:Homo sapiens (Human)
Description:ChEMBL_586597
Residue:833
BDBM50569666
NameBDBM50569666
Synonyms:CHEMBL4855158
TypeSmall organic molecule
Emp. Form.C25H30N6O3
Mol. Mass.462.5441
SMILESCOC(C)c1ccccc1Nc1nc(Nc2cc3CN(C)CCc3cc2OC)ncc1C(N)=O