Reaction Details
TargetMitogen-activated protein kinase kinase kinase kinase 1
LigandBDBM50569671
Substrate/Competitorn/a
Meas. Tech.ChEMBL_2109901 (CHEMBL4818576)
IC50 0.160000±n/a nM
Citation Vara, BALevi, SMAchab, ACandito, DAFradera, XLesburg, CAKawamura, SLacey, BMLim, JMethot, JLXu, ZXu, HSmith, DMPiesvaux, JAMiller, JRBittinger, MRanganath, SHBennett, DJDiMauro, EFPasternak, A Discovery of Diaminopyrimidine Carboxamide HPK1 Inhibitors as Preclinical Immunotherapy Tool Compounds. ACS Med Chem Lett12:653-661 (2021) 
 
Mitogen-activated protein kinase kinase kinase kinase 1
Name:Mitogen-activated protein kinase kinase kinase kinase 1
Type:PROTEIN
Mol. Mass.:91316.07
Organism:Homo sapiens (Human)
Description:ChEMBL_586597
Residue:833
BDBM50569671
NameBDBM50569671
Synonyms:CHEMBL4860645
TypeSmall organic molecule
Emp. Form.C26H30N6O3
Mol. Mass.474.5548
SMILESCOc1cc2CCN(C)Cc2cc1Nc1ncc(C(N)=O)c(Nc2ccccc2C2CCCO2)n1