Reaction Details
TargetMitogen-activated protein kinase kinase kinase kinase 1
LigandBDBM552514
Substrate/Competitorn/a
Meas. Tech.ChEMBL_2109901 (CHEMBL4818576)
IC50 0.160000±n/a nM
Citation Vara, BALevi, SMAchab, ACandito, DAFradera, XLesburg, CAKawamura, SLacey, BMLim, JMethot, JLXu, ZXu, HSmith, DMPiesvaux, JAMiller, JRBittinger, MRanganath, SHBennett, DJDiMauro, EFPasternak, A Discovery of Diaminopyrimidine Carboxamide HPK1 Inhibitors as Preclinical Immunotherapy Tool Compounds. ACS Med Chem Lett12:653-661 (2021) 
 
Mitogen-activated protein kinase kinase kinase kinase 1
Name:Mitogen-activated protein kinase kinase kinase kinase 1
Type:PROTEIN
Mol. Mass.:91316.07
Organism:Homo sapiens (Human)
Description:ChEMBL_586597
Residue:833
BDBM552514
NameBDBM552514
Synonyms:2-((2-Methoxy-4-(4-methylpiperazine-1-carbonyl)phenyl)amino)-4-((2-(trifluoromethyl)phenyl)amino)pyrimidine-5-carboxamide | WO2022098809, Example 4-1
TypeSmall organic molecule
Emp. Form.C22H22F2N6O2
Mol. Mass.440.4459
SMILESCOc1cc2CCN(C)Cc2cc1Nc1ncc(C(N)=O)c(Nc2c(F)cccc2F)n1