Reaction Details
TargetATP-dependent translocase ABCB1
LigandBDBM50140818
Substrate/Competitorn/a
Meas. Tech.ChEMBL_147986 (CHEMBL754111)
IC50 5000±n/a nM
Citation Wang, SFolkes, AChuckowree, ICockcroft, XSohal, SMiller, WMilton, JWren, SPVicker, NDepledge, PScott, JSmith, LJones, HMistry, PFaint, RThompson, DCocks, S Studies on pyrrolopyrimidines as selective inhibitors of multidrug-resistance-associated protein in multidrug resistance. J Med Chem47:1329-38 (2004) 
 
ATP-dependent translocase ABCB1
Name:ATP-dependent translocase ABCB1
Type:PROTEIN
Mol. Mass.:141009.67
Organism:Mus musculus
Description:ChEMBL_474396
Residue:1276
BDBM50140818
NameBDBM50140818
Synonyms:4-(4-Phenethyl-piperazin-1-yl)-2-phenyl-6,7,8,9-tetrahydro-pyrimido[4,5-b]indolizine-10-carbonitrile | CHEMBL27497
TypeSmall organic molecule
Emp. Form.C29H30N6
Mol. Mass.462.5887
SMILESN#Cc1c2CCCCn2c2c(nc(nc12)-c1ccccc1)N1CCN(CCc2ccccc2)CC1