Reaction Details
TargetRetinoic acid receptor alpha
LigandBDBM50143824
Substrate/Competitorn/a
Meas. Tech.ChEMBL_197411 (CHEMBL799800)
Ki 93±n/a nM
Citation Haffner, CDLenhard, JMMiller, ABMcDougald, DLDwornik, KIttoop, ORGampe, RTXu, HEBlanchard, SMontana, VGConsler, TGBledsoe, RKAyscue, ACroom, D Structure-based design of potent retinoid X receptor alpha agonists. J Med Chem47:2010-29 (2004) 
 
Retinoic acid receptor alpha
Name:Retinoic acid receptor alpha
Type:PROTEIN
Mol. Mass.:50778.87
Organism:Homo sapiens (Human)
Description:ChEMBL_1466191
Residue:462
BDBM50143824
NameBDBM50143824
Synonyms:(E)-3-[5-(5,5,8,8-Tetramethyl-5,6,7,8-tetrahydro-naphthalen-2-yl)-furan-2-yl]-acrylic acid | CHEMBL62047
TypeSmall organic molecule
Emp. Form.C21H24O3
Mol. Mass.324.4135
SMILESCC1(C)CCC(C)(C)c2cc(ccc12)-c1ccc(\C=C\C(O)=O)o1