Reaction Details
TargetRetinoic acid receptor alpha
LigandBDBM50143833
Substrate/Competitorn/a
Meas. Tech.ChEMBL_197411 (CHEMBL799800)
Ki>1000±n/a nM
Citation Haffner, CDLenhard, JMMiller, ABMcDougald, DLDwornik, KIttoop, ORGampe, RTXu, HEBlanchard, SMontana, VGConsler, TGBledsoe, RKAyscue, ACroom, D Structure-based design of potent retinoid X receptor alpha agonists. J Med Chem47:2010-29 (2004) 
 
Retinoic acid receptor alpha
Name:Retinoic acid receptor alpha
Type:PROTEIN
Mol. Mass.:50778.87
Organism:Homo sapiens (Human)
Description:ChEMBL_1466191
Residue:462
BDBM50143833
NameBDBM50143833
Synonyms:(E)-3-[4-(5,5,8,8-Tetramethyl-5,6,7,8-tetrahydro-naphthalen-2-yl)-4,5,6,7-tetrahydro-benzo[b]thiophen-2-yl]-acrylic acid | CHEMBL62537
TypeSmall organic molecule
Emp. Form.C25H30O2S
Mol. Mass.394.57
SMILESCC1(C)CCC(C)(C)c2cc(ccc12)C1CCCc2sc(\C=C\C(O)=O)cc12