Reaction Details
TargetRetinoic acid receptor RXR-alpha
LigandBDBM50143827
Substrate/Competitorn/a
Meas. Tech.ChEMBL_196486 (CHEMBL798300)
Ki 20±n/a nM
Citation Haffner, CDLenhard, JMMiller, ABMcDougald, DLDwornik, KIttoop, ORGampe, RTXu, HEBlanchard, SMontana, VGConsler, TGBledsoe, RKAyscue, ACroom, D Structure-based design of potent retinoid X receptor alpha agonists. J Med Chem47:2010-29 (2004) 
 
Retinoic acid receptor RXR-alpha
Name:Retinoic acid receptor RXR-alpha
Type:PROTEIN
Mol. Mass.:50820.38
Organism:Homo sapiens (Human)
Description:ChEMBL_1456363
Residue:462
BDBM50143827
NameBDBM50143827
Synonyms:(E)-3-[4-(3-Methoxy-5,5,8,8-tetramethyl-5,6,7,8-tetrahydro-naphthalen-2-yl)-4,5,6,7-tetrahydro-benzofuran-2-yl]-acrylic acid | CHEMBL294346
TypeSmall organic molecule
Emp. Form.C26H32O4
Mol. Mass.408.5299
SMILESCOc1cc2c(cc1C1CCCc3oc(\C=C\C(O)=O)cc13)C(C)(C)CCC2(C)C