Reaction Details
TargetRetinoic acid receptor alpha
LigandBDBM50143835
Substrate/Competitorn/a
Meas. Tech.ChEMBL_197411 (CHEMBL799800)
Ki>1000±n/a nM
Citation Haffner, CDLenhard, JMMiller, ABMcDougald, DLDwornik, KIttoop, ORGampe, RTXu, HEBlanchard, SMontana, VGConsler, TGBledsoe, RKAyscue, ACroom, D Structure-based design of potent retinoid X receptor alpha agonists. J Med Chem47:2010-29 (2004) 
 
Retinoic acid receptor alpha
Name:Retinoic acid receptor alpha
Type:PROTEIN
Mol. Mass.:50778.87
Organism:Homo sapiens (Human)
Description:ChEMBL_1466191
Residue:462
BDBM50143835
NameBDBM50143835
Synonyms:(E)-3-[4-(5,5,8,8-Tetramethyl-5,6,7,8-tetrahydro-naphthalen-2-ylmethyl)-furan-2-yl]-acrylic acid | CHEMBL63048
TypeSmall organic molecule
Emp. Form.C22H26O3
Mol. Mass.338.44
SMILESCC1(C)CCC(C)(C)c2cc(Cc3coc(\C=C\C(O)=O)c3)ccc12