Reaction Details
TargetRetinoic acid receptor RXR-alpha
LigandBDBM50409929
Substrate/Competitorn/a
Meas. Tech.ChEMBL_196486 (CHEMBL798300)
Ki 79±n/a nM
Citation Haffner, CDLenhard, JMMiller, ABMcDougald, DLDwornik, KIttoop, ORGampe, RTXu, HEBlanchard, SMontana, VGConsler, TGBledsoe, RKAyscue, ACroom, D Structure-based design of potent retinoid X receptor alpha agonists. J Med Chem47:2010-29 (2004) 
 
Retinoic acid receptor RXR-alpha
Name:Retinoic acid receptor RXR-alpha
Type:PROTEIN
Mol. Mass.:50820.38
Organism:Homo sapiens (Human)
Description:ChEMBL_1456363
Residue:462
BDBM50409929
NameBDBM50409929
Synonyms:CHEMBL2113736
TypeSmall organic molecule
Emp. Form.C25H31NO3
Mol. Mass.393.5185
SMILESCN1CC(c2cc(\C=C\C(O)=O)oc2C1)c1ccc2c(c1)C(C)(C)CCC2(C)C