Reaction Details
TargetTryptase beta-2/delta/gamma
LigandBDBM50220841
Substrate/Competitorn/a
Meas. Tech.ChEMBL_210690 (CHEMBL817288)
IC50 4±n/a nM
Citation Bisacchi, GSSlusarchyk, WABolton, SAHartl, KSJacobs, GMathur, AMeng, WOgletree, MLPi, ZSutton, JCTreuner, UZahler, RZhao, GSeiler, SM Synthesis of potent and highly selective nonguanidine azetidinone inhibitors of human tryptase. Bioorg Med Chem Lett14:2227-31 (2004) 
 
Tryptase beta-2/delta/gamma
Name:Tryptase beta-2/delta/gamma
Synonyms:Tryptase
Type:n/a
Mol. Mass.:n/a
Description:ASSAY_ID of ChEMBL is 1510505
Components:This complex has 3 components.
Component 1
Name:Tryptase gamma
Type:PROTEIN
Mol. Mass.:33817.52
Organism:Homo sapiens (Human)
Description:ChEMBL_210833
Residue:321
Component 2
Name:Tryptase beta-2
Synonyms:TPS2 TRYB2_HUMAN Tryptase II Tryptase-2
Type:PROTEIN
Mol. Mass.:30518.79
Organism:Homo sapiens (Human)
Description:ChEMBL_210702
Residue:275
Component 3
Name:Tryptase delta
Synonyms:Delta-tryptase Mast cell mMCP-7-like TRYD_HUMAN Tryptase-3
Type:PROTEIN
Mol. Mass.:26578.73
Organism:Homo sapiens (Human)
Description:ChEMBL_104777
Residue:242
BDBM50220841
NameBDBM50220841
Synonyms:BMS-262084 | CHEMBL71037
TypeSmall organic molecule
Emp. Form.C18H31N7O5
Mol. Mass.425.4826
SMILES[#6]C([#6])([#6])[#7]-[#6](=O)-[#7]-1-[#6]-[#6]-[#7](-[#6]-[#6]-1)-[#6](=O)-[#7]-1-[#6@@H](-[#6@@H](-[#6]-[#6]-[#6]\[#7]=[#6](/[#7])-[#7])-[#6]-1=O)-[#6](-[#8])=O