Reaction Details
TargetATPase family AAA domain-containing protein 2
LigandBDBM50584941
Substrate/Competitorn/a
Meas. Tech.ChEMBL_2160899 (CHEMBL5045649)
IC50 32±n/a nM
Citation Winter-Holt, JJBardelle, CChiarparin, EDale, ILDavey, PRJDavies, NLDenz, CFillery, SMGuérot, CMHan, FHughes, SJKulkarni, MLiu, ZMilbradt, AMoss, TANiu, HPatel, JRabow, AASchimpl, MShi, JSun, DYang, DGuichard, S Discovery of a Potent and Selective ATAD2 Bromodomain Inhibitor with Antiproliferative Activity in Breast Cancer Models. J Med Chem65:3306-3331 (2022) 
 
ATPase family AAA domain-containing protein 2
Name:ATPase family AAA domain-containing protein 2
Type:PROTEIN
Mol. Mass.:158546.30
Organism:Homo sapiens (Human)
Description:ChEMBL_1500426
Residue:1390
BDBM50584941
NameBDBM50584941
Synonyms:CHEMBL5077167
TypeSmall organic molecule
Emp. Form.C24H28N8O2
Mol. Mass.460.5315
SMILES[H][C@]12Cc3ccccc3[C@]([H])(CNC1=O)N2C(=O)c1cc(NC2CCN(C)CC2)c2nnc(C)n2n1