Reaction Details
TargetATPase family AAA domain-containing protein 2
LigandBDBM50584943
Substrate/Competitorn/a
Meas. Tech.ChEMBL_2160902 (CHEMBL5045652)
IC50 41±n/a nM
Citation Winter-Holt, JJBardelle, CChiarparin, EDale, ILDavey, PRJDavies, NLDenz, CFillery, SMGuérot, CMHan, FHughes, SJKulkarni, MLiu, ZMilbradt, AMoss, TANiu, HPatel, JRabow, AASchimpl, MShi, JSun, DYang, DGuichard, S Discovery of a Potent and Selective ATAD2 Bromodomain Inhibitor with Antiproliferative Activity in Breast Cancer Models. J Med Chem65:3306-3331 (2022) 
 
ATPase family AAA domain-containing protein 2
Name:ATPase family AAA domain-containing protein 2
Type:PROTEIN
Mol. Mass.:158546.30
Organism:Homo sapiens (Human)
Description:ChEMBL_1500426
Residue:1390
BDBM50584943
NameBDBM50584943
Synonyms:CHEMBL5086059
TypeSmall organic molecule
Emp. Form.C25H30N8O2
Mol. Mass.474.5581
SMILES[H][C@]12Cc3ccccc3[C@]([H])(CNC1=O)N2C(=O)c1cc(NCCCN2CCCC2)c2nnc(C)n2n1