Reaction Details
TargetATPase family AAA domain-containing protein 2
LigandBDBM50584925
Substrate/Competitorn/a
Meas. Tech.ChEMBL_2160906 (CHEMBL5045656)
IC50 126±n/a nM
Citation Winter-Holt, JJBardelle, CChiarparin, EDale, ILDavey, PRJDavies, NLDenz, CFillery, SMGuérot, CMHan, FHughes, SJKulkarni, MLiu, ZMilbradt, AMoss, TANiu, HPatel, JRabow, AASchimpl, MShi, JSun, DYang, DGuichard, S Discovery of a Potent and Selective ATAD2 Bromodomain Inhibitor with Antiproliferative Activity in Breast Cancer Models. J Med Chem65:3306-3331 (2022) 
 
ATPase family AAA domain-containing protein 2
Name:ATPase family AAA domain-containing protein 2
Type:PROTEIN
Mol. Mass.:158546.30
Organism:Homo sapiens (Human)
Description:ChEMBL_1500426
Residue:1390
BDBM50584925
NameBDBM50584925
Synonyms:CHEMBL5079885
TypeSmall organic molecule
Emp. Form.C30H39FN8O2
Mol. Mass.562.6815
SMILES[H][C@]12Cc3ccccc3[C@]([H])([C@H](NC1=O)C(C)C)N2C(=O)c1cc(NC2CCN(CC(C)(C)F)CC2)c2nnc(C)n2n1