Reaction Details
TargetVascular endothelial growth factor receptor 2
LigandBDBM13216
Substrate/Competitorn/a
Meas. Tech.ChEMBL_430266 (CHEMBL914505)
IC50>2000±n/a nM
Citation Lombardo, LJLee, FYChen, PNorris, DBarrish, JCBehnia, KCastaneda, SCornelius, LADas, JDoweyko, AMFairchild, CHunt, JTInigo, IJohnston, KKamath, AKan, DKlei, HMarathe, PPang, SPeterson, RPitt, SSchieven, GLSchmidt, RJTokarski, JWen, MLWityak, JBorzilleri, RM Discovery of N-(2-chloro-6-methyl- phenyl)-2-(6-(4-(2-hydroxyethyl)- piperazin-1-yl)-2-methylpyrimidin-4- ylamino)thiazole-5-carboxamide (BMS-354825), a dual Src/Abl kinase inhibitor with potent antitumor activity in preclinical assays. J Med Chem47:6658-61 (2004) 
 
Vascular endothelial growth factor receptor 2
Name:Vascular endothelial growth factor receptor 2
Type:Receptor Tyrosine Kinase
Mol. Mass.:151510.97
Organism:Homo sapiens (Human)
Description:P35968
Residue:1356
BDBM13216
NameBDBM13216
Synonyms:BMS-354825 DASATINIB N-(2-chloro-6-methylphenyl)-2-({6-[4-(2-hydroxyethyl)piperazin-1-yl]-2-methylpyrimidin-4-yl}amino)-1,3-thiazole-5-carboxamide US20230348453, Compound A8 med.21724, Compound Dasatinib
TypeSmall organic molecule
Emp. Form.C22H26ClN7O2S
Mol. Mass.488.006
SMILESCc1nc(Nc2ncc(s2)C(=O)Nc2c(C)cccc2Cl)cc(n1)N1CCN(CCO)CC1