Reaction Details
TargetDNA topoisomerase 4 subunit A
LigandBDBM50178897
Substrate/Competitorn/a
Meas. Tech.ChEMBL_338453 (CHEMBL865343)
IC50 3300±n/a nM
Citation Wiles, JASong, YWang, QLucien, EHashimoto, ACheng, JMarlor, CWOu, YPodos, SDThanassi, JAThoma, CLDeshpande, MPucci, MJBradbury, BJ Biological evaluation of isothiazoloquinolones containing aromatic heterocycles at the 7-position: In vitro activity of a series of potent antibacterial agents that are effective against methicillin-resistant Staphylococcus aureus. Bioorg Med Chem Lett16:1277-81 (2006) 
 
DNA topoisomerase 4 subunit A
Name:DNA topoisomerase 4 subunit A
Type:PROTEIN
Mol. Mass.:91040.14
Organism:Staphylococcus aureus
Description:ChEMBL_340188
Residue:800
BDBM50178897
NameBDBM50178897
Synonyms:9-cyclopropyl-6-fluoro-7-(2-methoxypyrimidin-5-yl)isothiazolo[5,4-b]quinoline-3,4(2H,9H)-dione | CHEMBL203979
TypeSmall organic molecule
Emp. Form.C18H13FN4O3S
Mol. Mass.384.384
SMILESCOc1ncc(cn1)-c1cc2n(C3CC3)c3s[nH]c(=O)c3c(=O)c2cc1F