Reaction Details
TargetDNA topoisomerase 4 subunit A
LigandBDBM50178904
Substrate/Competitorn/a
Meas. Tech.ChEMBL_338453 (CHEMBL865343)
IC50 3300±n/a nM
Citation Wiles, JASong, YWang, QLucien, EHashimoto, ACheng, JMarlor, CWOu, YPodos, SDThanassi, JAThoma, CLDeshpande, MPucci, MJBradbury, BJ Biological evaluation of isothiazoloquinolones containing aromatic heterocycles at the 7-position: In vitro activity of a series of potent antibacterial agents that are effective against methicillin-resistant Staphylococcus aureus. Bioorg Med Chem Lett16:1277-81 (2006) 
 
DNA topoisomerase 4 subunit A
Name:DNA topoisomerase 4 subunit A
Type:PROTEIN
Mol. Mass.:91040.14
Organism:Staphylococcus aureus
Description:ChEMBL_340188
Residue:800
BDBM50178904
NameBDBM50178904
Synonyms:9-cyclopropyl-6-fluoro-7-(1H-indol-2-yl)isothiazolo[5,4-b]quinoline-3,4(2H,9H)-dione | CHEMBL204762
TypeSmall organic molecule
Emp. Form.C21H14FN3O2S
Mol. Mass.391.418
SMILESFc1cc2c(cc1-c1cc3ccccc3[nH]1)n(C1CC1)c1s[nH]c(=O)c1c2=O