Reaction Details
TargetDNA topoisomerase 4 subunit A
LigandBDBM50178922
Substrate/Competitorn/a
Meas. Tech.ChEMBL_340188 (CHEMBL864372)
IC50 1500±n/a nM
Citation Wiles, JAWang, QLucien, EHashimoto, ASong, YCheng, JMarlor, CWOu, YPodos, SDThanassi, JAThoma, CLDeshpande, MPucci, MJBradbury, BJ Isothiazoloquinolones containing functionalized aromatic hydrocarbons at the 7-position: synthesis and in vitro activity of a series of potent antibacterial agents with diminished cytotoxicity in human cells. Bioorg Med Chem Lett16:1272-6 (2006) 
 
DNA topoisomerase 4 subunit A
Name:DNA topoisomerase 4 subunit A
Type:PROTEIN
Mol. Mass.:91040.14
Organism:Staphylococcus aureus
Description:ChEMBL_340188
Residue:800
BDBM50178922
NameBDBM50178922
Synonyms:7-(4-(aminomethyl)phenyl)-9-cyclopropyl-6-fluoroisothiazolo[5,4-b]quinoline-3,4(2H,9H)-dione | CHEMBL383497
TypeSmall organic molecule
Emp. Form.C20H16FN3O2S
Mol. Mass.381.423
SMILESNCc1ccc(cc1)-c1cc2n(C3CC3)c3s[nH]c(=O)c3c(=O)c2cc1F