Reaction Details
TargetDNA topoisomerase 4 subunit A
LigandBDBM50178929
Substrate/Competitorn/a
Meas. Tech.ChEMBL_340188 (CHEMBL864372)
IC50 2600±n/a nM
Citation Wiles, JAWang, QLucien, EHashimoto, ASong, YCheng, JMarlor, CWOu, YPodos, SDThanassi, JAThoma, CLDeshpande, MPucci, MJBradbury, BJ Isothiazoloquinolones containing functionalized aromatic hydrocarbons at the 7-position: synthesis and in vitro activity of a series of potent antibacterial agents with diminished cytotoxicity in human cells. Bioorg Med Chem Lett16:1272-6 (2006) 
 
DNA topoisomerase 4 subunit A
Name:DNA topoisomerase 4 subunit A
Type:PROTEIN
Mol. Mass.:91040.14
Organism:Staphylococcus aureus
Description:ChEMBL_340188
Residue:800
BDBM50178929
NameBDBM50178929
Synonyms:9-cyclopropyl-6-fluoro-7-(4-(piperidin-2-yl)phenyl)isothiazolo[5,4-b]quinoline-3,4(2H,9H)-dione | CHEMBL382817
TypeSmall organic molecule
Emp. Form.C24H22FN3O2S
Mol. Mass.435.514
SMILESFc1cc2c(cc1-c1ccc(cc1)C1CCCCN1)n(C1CC1)c1s[nH]c(=O)c1c2=O