Reaction Details
TargetKinesin-like protein KIF11
LigandBDBM50181135
Substrate/Competitorn/a
Meas. Tech.ChEMBL_345008 (CHEMBL868957)
IC50 5.5±n/a nM
Citation Garbaccio, RMFraley, METasber, ESOlson, CMHoffman, WFArrington, KLTorrent, MBuser, CAWalsh, ESHamilton, KSchaber, MDFernandes, CLobell, RBTao, WSouth, VJYan, YKuo, LCPrueksaritanont, TSlaughter, DEShu, CHeimbrook, DCKohl, NEHuber, HEHartman, GD Kinesin spindle protein (KSP) inhibitors. Part 3: synthesis and evaluation of phenolic 2,4-diaryl-2,5-dihydropyrroles with reduced hERG binding and employment of a phosphate prodrug strategy for aqueous solubility. Bioorg Med Chem Lett16:1780-3 (2006) 
 
Kinesin-like protein KIF11
Name:Kinesin-like protein KIF11
Type:PROTEIN
Mol. Mass.:119138.97
Organism:Homo sapiens (Human)
Description:ChEMBL_1457426
Residue:1056
BDBM50181135
NameBDBM50181135
Synonyms:CHEMBL206249 | rac-4-(2,5-difluorophenyl)-2-(3-hydroxyphenyl)-N-methyl-N-(piperidin-4-yl)-2H-pyrrole-1(5H)-carboxamide
TypeSmall organic molecule
Emp. Form.C23H25F2N3O2
Mol. Mass.413.4603
SMILESCN(C1CCNCC1)C(=O)N1CC(=CC1c1cccc(O)c1)c1cc(F)ccc1F