Reaction Details
TargetKinesin-like protein KIF11
LigandBDBM50181141
Substrate/Competitorn/a
Meas. Tech.ChEMBL_345008 (CHEMBL868957)
IC50 2.9±n/a nM
Citation Garbaccio, RMFraley, METasber, ESOlson, CMHoffman, WFArrington, KLTorrent, MBuser, CAWalsh, ESHamilton, KSchaber, MDFernandes, CLobell, RBTao, WSouth, VJYan, YKuo, LCPrueksaritanont, TSlaughter, DEShu, CHeimbrook, DCKohl, NEHuber, HEHartman, GD Kinesin spindle protein (KSP) inhibitors. Part 3: synthesis and evaluation of phenolic 2,4-diaryl-2,5-dihydropyrroles with reduced hERG binding and employment of a phosphate prodrug strategy for aqueous solubility. Bioorg Med Chem Lett16:1780-3 (2006) 
 
Kinesin-like protein KIF11
Name:Kinesin-like protein KIF11
Type:PROTEIN
Mol. Mass.:119138.97
Organism:Homo sapiens (Human)
Description:ChEMBL_1457426
Residue:1056
BDBM50181141
NameBDBM50181141
Synonyms:(S)-2-cyclopropyl-1-((S)-4-(2,5-difluorophenyl)-2-(3-hydroxyphenyl)-2H-pyrrol-1(5H)-yl)-2-hydroxyethanone | CHEMBL377596
TypeSmall organic molecule
Emp. Form.C21H19F2NO3
Mol. Mass.371.3773
SMILESO[C@@H](C1CC1)C(=O)N1CC(=C[C@H]1c1cccc(O)c1)c1cc(F)ccc1F