Reaction Details
TargetInhibitor of nuclear factor kappa-B kinase subunit beta
LigandBDBM50186624
Substrate/Competitorn/a
Meas. Tech.ChEMBL_353243 (CHEMBL865082)
IC50 2200±n/a nM
Citation Morwick, TBerry, ABrickwood, JCardozo, MCatron, KDeTuri, MEmeigh, JHomon, CHrapchak, MJacober, SJakes, SKaplita, PKelly, TAKsiazek, JLiuzzi, MMagolda, RMao, CMarshall, DMcNeil, DProkopowicz, ASarko, CScouten, ESledziona, CSun, SWatrous, JWu, JPCywin, CL Evolution of the thienopyridine class of inhibitors of IkappaB kinase-beta: part I: hit-to-lead strategies. J Med Chem49:2898-908 (2006) 
 
Inhibitor of nuclear factor kappa-B kinase subunit beta
Name:Inhibitor of nuclear factor kappa-B kinase subunit beta
Type:Serine/threonine-protein kinase
Mol. Mass.:86554.39
Organism:Homo sapiens (Human)
Description:GST-tagged IKK-2 was expressed in High Five cells and purified.
Residue:756
BDBM50186624
NameBDBM50186624
Synonyms:3-amino-4,6-dimethylthieno[2,3-b]pyridine-2-carboxamide | CHEMBL377085
TypeSmall organic molecule
Emp. Form.C10H11N3OS
Mol. Mass.221.279
SMILESCc1cc(C)c2c(N)c(sc2n1)C(N)=O