Reaction Details
TargetInhibitor of nuclear factor kappa-B kinase subunit beta
LigandBDBM50186637
Substrate/Competitorn/a
Meas. Tech.ChEMBL_353243 (CHEMBL865082)
IC50 1600±n/a nM
Citation Morwick, TBerry, ABrickwood, JCardozo, MCatron, KDeTuri, MEmeigh, JHomon, CHrapchak, MJacober, SJakes, SKaplita, PKelly, TAKsiazek, JLiuzzi, MMagolda, RMao, CMarshall, DMcNeil, DProkopowicz, ASarko, CScouten, ESledziona, CSun, SWatrous, JWu, JPCywin, CL Evolution of the thienopyridine class of inhibitors of IkappaB kinase-beta: part I: hit-to-lead strategies. J Med Chem49:2898-908 (2006) 
 
Inhibitor of nuclear factor kappa-B kinase subunit beta
Name:Inhibitor of nuclear factor kappa-B kinase subunit beta
Type:Serine/threonine-protein kinase
Mol. Mass.:86554.39
Organism:Homo sapiens (Human)
Description:GST-tagged IKK-2 was expressed in High Five cells and purified.
Residue:756
BDBM50186637
NameBDBM50186637
Synonyms:3-(3-methyl-ureido)-5-phenyl-thiophene-2-carboxylic acid amide | CHEMBL383723
TypeSmall organic molecule
Emp. Form.C13H13N3O2S
Mol. Mass.275.326
SMILESCNC(=O)Nc1cc(sc1C(N)=O)-c1ccccc1