Reaction Details
TargetCytochrome P450 3A4
LigandBDBM50186618
Substrate/Competitorn/a
Meas. Tech.ChEMBL_353252 (CHEMBL861848)
IC50 2000±n/a nM
Citation Morwick, TBerry, ABrickwood, JCardozo, MCatron, KDeTuri, MEmeigh, JHomon, CHrapchak, MJacober, SJakes, SKaplita, PKelly, TAKsiazek, JLiuzzi, MMagolda, RMao, CMarshall, DMcNeil, DProkopowicz, ASarko, CScouten, ESledziona, CSun, SWatrous, JWu, JPCywin, CL Evolution of the thienopyridine class of inhibitors of IkappaB kinase-beta: part I: hit-to-lead strategies. J Med Chem49:2898-908 (2006) 
 
Cytochrome P450 3A4
Name:Cytochrome P450 3A4
Type:Enzyme
Mol. Mass.:57349.57
Organism:Homo sapiens (Human)
Description:n/a
Residue:503
BDBM50186618
NameBDBM50186618
Synonyms:3-amino-5-(4-fluoro-phenyl)-thiophene-2-carboxylic acid amide | CHEMBL207071
TypeSmall organic molecule
Emp. Form.C11H9FN2OS
Mol. Mass.236.265
SMILESNC(=O)c1sc(cc1N)-c1ccc(F)cc1