Reaction Details
TargetNeprilysin
LigandBDBM50197513
Substrate/Competitorn/a
Meas. Tech.ChEMBL_432271 (CHEMBL914049)
pH7±n/a
IC50 3.7±n/a nM
Commentsextracted
Citation Pryde, DCCook, ASBurring, DJJones, LHFoll, SPlatts, MYSanderson, VCorless, MStobie, AMiddleton, DSFoster, LBarker, LVan Der Graaf, PStacey, PKohl, CCoggon, SBeaumont, K Novel selective inhibitors of neutral endopeptidase for the treatment of female sexual arousal disorder. Bioorg Med Chem15:142-59 (2006) 
 
Neprilysin
Name:Neprilysin
Type:Enzyme
Mol. Mass.:85505.38
Organism:Homo sapiens (Human)
Description:P08473
Residue:750
BDBM50197513
NameBDBM50197513
Synonyms:(S)-2-((1-((2-(hydroxymethyl)-2,3-dihydro-1H-inden-2-yl)carbamoyl)cyclopentyl)methyl)-4-methoxybutanoic acid | CHEMBL225084
TypeSmall organic molecule
Emp. Form.C22H31NO5
Mol. Mass.389.4852
SMILESCOCC[C@H](CC1(CCCC1)C(=O)NC1(CO)Cc2ccccc2C1)C(O)=O