Reaction Details
TargetNeprilysin
LigandBDBM50197507
Substrate/Competitorn/a
Meas. Tech.ChEMBL_432275 (CHEMBL914053)
pH7.4±n/a
IC50 13.8±n/a nM
Commentsextracted
Citation Pryde, DCCook, ASBurring, DJJones, LHFoll, SPlatts, MYSanderson, VCorless, MStobie, AMiddleton, DSFoster, LBarker, LVan Der Graaf, PStacey, PKohl, CCoggon, SBeaumont, K Novel selective inhibitors of neutral endopeptidase for the treatment of female sexual arousal disorder. Bioorg Med Chem15:142-59 (2006) 
 
Neprilysin
Name:Neprilysin
Type:Enzyme
Mol. Mass.:85505.38
Organism:Homo sapiens (Human)
Description:P08473
Residue:750
BDBM50197507
NameBDBM50197507
Synonyms:(S)-4-methoxy-2-{1-[(1R,2S)-2-(4-methoxy-phenyl)-cyclopropylcarbamoyl]-cyclopentylmethyl}-butyric acid | CHEMBL389061
TypeSmall organic molecule
Emp. Form.C22H31NO5
Mol. Mass.389.4852
SMILESCOCC[C@H](CC1(CCCC1)C(=O)N[C@@H]1C[C@H]1c1ccc(OC)cc1)C(O)=O