Reaction Details
TargetC-C chemokine receptor type 2
LigandBDBM50224523
Substrate/Competitorn/a
Meas. Tech.ChEMBL_450803 (CHEMBL899888)
IC50 4±n/a nM
Citation Xia, MHou, CDeMong, DEPollack, SRPan, MBrackley, JAJain, NGerchak, CSinger, MMalaviya, RMatheis, MOlini, GCavender, DWachter, M Synthesis, structure-activity relationship and in vivo antiinflammatory efficacy of substituted dipiperidines as CCR2 antagonists. J Med Chem50:5561-3 (2007) 
 
C-C chemokine receptor type 2
Name:C-C chemokine receptor type 2
Type:Enzyme
Mol. Mass.:41932.32
Organism:Homo sapiens (Human)
Description:P41597
Residue:374
BDBM50224523
NameBDBM50224523
Synonyms:(E)-2-(4-(1H-indol-3-yl)piperidin-1-yl)-2-(1-(3-(3,4-dichlorophenyl)acryloyl)piperidin-4-yl)acetic acid | CHEMBL236930
TypeSmall organic molecule
Emp. Form.C29H31Cl2N3O3
Mol. Mass.540.481
SMILESOC(=O)C(C1CCN(CC1)C(=O)\C=C\c1ccc(Cl)c(Cl)c1)N1CCC(CC1)c1c[nH]c2ccccc12