Reaction Details
TargetCyclin-dependent kinase 2
LigandBDBM50275665
Substrate/Competitorn/a
Meas. Tech.ChEMBL_492873 (CHEMBL942204)
IC50 230±n/a nM
Citation Cheung, MKuntz, KWPobanz, MSalovich, JMWilson, BJAndrews, CWShewchuk, LMEpperly, AHHassler, DFLeesnitzer, MASmith, JLSmith, GKLansing, TJMook, RA Imidazo[5,1-f][1,2,4]triazin-2-amines as novel inhibitors of polo-like kinase 1. Bioorg Med Chem Lett18:6214-7 (2008) 
 
Cyclin-dependent kinase 2
Name:Cyclin-dependent kinase 2
Type:Enzyme Subunit
Mol. Mass.:33938.17
Organism:Homo sapiens (Human)
Description:P24941
Residue:298
BDBM50275665
NameBDBM50275665
Synonyms:5-methyl-7-phenyl-N-(3,4,5-trimethoxyphenyl)imidazo[1,5-f][1,2,4]triazin-2-amine CHEMBL519715
TypeSmall organic molecule
Emp. Form.C21H21N5O3
Mol. Mass.391.4231
SMILESCOc1cc(Nc2ncc3c(C)nc(-c4ccccc4)n3n2)cc(OC)c1OC