Reaction Details
TargetSerine/threonine-protein kinase PLK1
LigandBDBM50275664
Substrate/Competitorn/a
Meas. Tech.ChEMBL_492860 (CHEMBL942191)
IC50 90±n/a nM
Citation Cheung, MKuntz, KWPobanz, MSalovich, JMWilson, BJAndrews, CWShewchuk, LMEpperly, AHHassler, DFLeesnitzer, MASmith, JLSmith, GKLansing, TJMook, RA Imidazo[5,1-f][1,2,4]triazin-2-amines as novel inhibitors of polo-like kinase 1. Bioorg Med Chem Lett18:6214-7 (2008) 
 
Serine/threonine-protein kinase PLK1
Name:Serine/threonine-protein kinase PLK1
Type:Serine/threonine-protein kinase
Mol. Mass.:68277.16
Organism:Homo sapiens (Human)
Description:P53350
Residue:603
BDBM50275664
NameBDBM50275664
Synonyms:CHEMBL521204 | N-(3,4-dimethoxyphenyl)-5-methyl-7-phenylimidazo[1,5-f][1,2,4]triazin-2-amine
TypeSmall organic molecule
Emp. Form.C20H19N5O2
Mol. Mass.361.3972
SMILESCOc1ccc(Nc2ncc3c(C)nc(-c4ccccc4)n3n2)cc1OC