Reaction Details
Target11-beta-hydroxysteroid dehydrogenase 1
LigandBDBM50273858
Substrate/Competitorn/a
Meas. Tech.ChEMBL_561233 (CHEMBL1013588)
IC50 32±n/a nM
Citation Fotsch, CBartberger, MDBercot, EAChen, MCupples, REmery, MFretland, JGuram, AHale, CHan, NHickman, DHungate, RWHayashi, MKomorowski, RLiu, QMatsumoto, GSt Jean, DJUrsu, SVéniant, MXu, GYe, QYuan, CZhang, JZhang, XTu, HWang, M Further studies with the 2-amino-1,3-thiazol-4(5H)-one class of 11beta-hydroxysteroid dehydrogenase type 1 inhibitors: reducing pregnane X receptor activity and exploring activity in a monkey pharmacodynamic model. J Med Chem51:7953-67 (2008) 
 
11-beta-hydroxysteroid dehydrogenase 1
Name:11-beta-hydroxysteroid dehydrogenase 1
Type:Enzyme
Mol. Mass.:32409.16
Organism:Homo sapiens (Human)
Description:P28845
Residue:292
BDBM50273858
NameBDBM50273858
Synonyms:2-[(S)-1-(4-Fluorophenyl)ethylamino]-5-(1-hydroxycyclobutyl)-5-methylthiazol-4(5H)-one | CHEMBL460393
TypeSmall organic molecule
Emp. Form.C16H19FN2O2S
Mol. Mass.322.398
SMILESC[C@H](NC1=NC(=O)C(C)(S1)C1(O)CCC1)c1ccc(F)cc1