Reaction Details
TargetMacrophage metalloelastase
LigandBDBM50295480
Substrate/Competitorn/a
Meas. Tech.ChEMBL_579099 (CHEMBL1062301)
IC50 87±n/a nM
Citation Li, WLi, JWu, YRancati, FVallese, SRaveglia, LWu, JHotchandani, RFuller, NCunningham, KMorgan, PFish, SKrykbaev, RXu, XTam, SGoldman, SJAbraham, WWilliams, CSypek, JMansour, TS Identification of an orally efficacious matrix metalloprotease 12 inhibitor for potential treatment of asthma. J Med Chem52:5408-19 (2009) 
 
Macrophage metalloelastase
Name:Macrophage metalloelastase
Type:Enzyme
Mol. Mass.:54012.99
Organism:Homo sapiens (Human)
Description:P39900
Residue:470
BDBM50295480
NameBDBM50295480
Synonyms:(R)-2-(Dibenzo[b,d]thiophene-2-sulfonamido)-3-methylbutanoic acid | CHEMBL570310
TypeSmall organic molecule
Emp. Form.C17H17NO4S2
Mol. Mass.363.451
SMILESCC(C)[C@@H](NS(=O)(=O)c1ccc2sc3ccccc3c2c1)C(O)=O