Reaction Details
TargetCollagenase 3
LigandBDBM50295481
Substrate/Competitorn/a
Meas. Tech.ChEMBL_579100 (CHEMBL1062302)
IC50 60000±n/a nM
Citation Li, WLi, JWu, YRancati, FVallese, SRaveglia, LWu, JHotchandani, RFuller, NCunningham, KMorgan, PFish, SKrykbaev, RXu, XTam, SGoldman, SJAbraham, WWilliams, CSypek, JMansour, TS Identification of an orally efficacious matrix metalloprotease 12 inhibitor for potential treatment of asthma. J Med Chem52:5408-19 (2009) 
 
Collagenase 3
Name:Collagenase 3
Type:Enzyme
Mol. Mass.:53808.06
Organism:Homo sapiens (Human)
Description:P45452
Residue:471
BDBM50295481
NameBDBM50295481
Synonyms:(S)-2-(Dibenzo[b,d]thiophene-2-sulfonamido)-3-methylbutanoic acid | CHEMBL551190
TypeSmall organic molecule
Emp. Form.C17H17NO4S2
Mol. Mass.363.451
SMILESCC(C)[C@H](NS(=O)(=O)c1ccc2sc3ccccc3c2c1)C(O)=O