Reaction Details
TargetProstaglandin G/H synthase 2
LigandBDBM50297699
Substrate/Competitorn/a
Meas. Tech.ChEMBL_583916 (CHEMBL1059968)
IC50 104±n/a nM
Citation Beswick, PJBlackaby, APBountra, CBrown, TBrowning, KCampbell, IBCorfield, JGleave, RJGuntrip, SBHall, RMHindley, SLambeth, PFLucas, FMathews, NNaylor, APlayer, HPrice, HSSidebottom, PJTaylor, NLWebb, GWiseman, J Identification and optimisation of a novel series of pyrimidine based cyclooxygenase-2 (COX-2) inhibitors. Utilisation of a biotransformation approach. Bioorg Med Chem Lett19:4509-14 (2009) 
 
Prostaglandin G/H synthase 2
Name:Prostaglandin G/H synthase 2
Type:Enzyme
Mol. Mass.:69003.89
Organism:Homo sapiens (Human)
Description:Recombinant Cox-2 provided by Cayman (Cayman Chemical Co.,Ann Arbor, MI).
Residue:604
BDBM50297699
NameBDBM50297699
Synonyms:2-benzyl-4-(4-fluorophenyl)-5-(4-(methylsulfonyl)phenyl)pyrimidine | CHEMBL563455
TypeSmall organic molecule
Emp. Form.C24H19FN2O2S
Mol. Mass.418.483
SMILESCS(=O)(=O)c1ccc(cc1)-c1cnc(Cc2ccccc2)nc1-c1ccc(F)cc1