Reaction Details
TargetProstaglandin G/H synthase 2
LigandBDBM50297709
Substrate/Competitorn/a
Meas. Tech.ChEMBL_583916 (CHEMBL1059968)
IC50 43±n/a nM
Citation Beswick, PJBlackaby, APBountra, CBrown, TBrowning, KCampbell, IBCorfield, JGleave, RJGuntrip, SBHall, RMHindley, SLambeth, PFLucas, FMathews, NNaylor, APlayer, HPrice, HSSidebottom, PJTaylor, NLWebb, GWiseman, J Identification and optimisation of a novel series of pyrimidine based cyclooxygenase-2 (COX-2) inhibitors. Utilisation of a biotransformation approach. Bioorg Med Chem Lett19:4509-14 (2009) 
 
Prostaglandin G/H synthase 2
Name:Prostaglandin G/H synthase 2
Type:Enzyme
Mol. Mass.:69003.89
Organism:Homo sapiens (Human)
Description:Recombinant Cox-2 provided by Cayman (Cayman Chemical Co.,Ann Arbor, MI).
Residue:604
BDBM50297709
NameBDBM50297709
Synonyms:2-((4-(4-fluorophenyl)-5-(4-(methylsulfonyl)phenyl)pyrimidin-2-yl)methyl)phenol | CHEMBL560088
TypeSmall organic molecule
Emp. Form.C24H19FN2O3S
Mol. Mass.434.483
SMILESCS(=O)(=O)c1ccc(cc1)-c1cnc(Cc2ccccc2O)nc1-c1ccc(F)cc1