Reaction Details
TargetPeroxisome proliferator-activated receptor alpha
LigandBDBM28700
Substrate/Competitorn/a
Meas. Tech.ChEMBL_591830 (CHEMBL1042379)
EC50 30000±n/a nM
Citation Fracchiolla, GLaghezza, APiemontese, LTortorella, PMazza, FMontanari, RPochetti, GLavecchia, ANovellino, EPierno, SConte Camerino, DLoiodice, F New 2-aryloxy-3-phenyl-propanoic acids as peroxisome proliferator-activated receptors alpha/gamma dual agonists with improved potency and reduced adverse effects on skeletal muscle function. J Med Chem52:6382-93 (2009) 
 
Peroxisome proliferator-activated receptor alpha
Name:Peroxisome proliferator-activated receptor alpha
Type:Enzyme
Mol. Mass.:52222.08
Organism:Homo sapiens (Human)
Description:Q07869
Residue:468
BDBM28700
NameBDBM28700
Synonyms:2-(4-(4-Chlorobenzoyl)phenoxy)-2-methylpropionic acid CHEMBL981 FIBRICOR LF 153 procetofenic acid
TypeSmall organic molecule
Emp. Form.C17H15ClO4
Mol. Mass.318.752
SMILESCC(C)(Oc1ccc(cc1)C(=O)c1ccc(Cl)cc1)C(O)=O