Reaction Details
TargetLIM domain kinase 2
LigandBDBM50299584
Substrate/Competitorn/a
Meas. Tech.ChEMBL_592392 (CHEMBL1036965)
IC50 1.5±n/a nM
Citation Harrison, BAWhitlock, NAVoronkov, MVAlmstead, ZYGu, KJMabon, RGardyan, MHamman, BDAllen, JGopinathan, SMcKnight, BCrist, MZhang, YLiu, YCourtney, LFKey, BZhou, JPatel, NYates, PWLiu, QWilson, AGKimball, SDCrosson, CERice, DSRawlins, DB Novel class of LIM-kinase 2 inhibitors for the treatment of ocular hypertension and associated glaucoma. J Med Chem52:6515-8 (2009) 
 
LIM domain kinase 2
Name:LIM domain kinase 2
Type:PROTEIN
Mol. Mass.:72238.81
Organism:Homo sapiens (Human)
Description:ChEMBL_1514398
Residue:638
BDBM50299584
NameBDBM50299584
Synonyms:(S)-N-(3-bromo-4-fluorophenyl)-N'-cyano-2-methyl-4-(5-methyl-7H-pyrrolo[2,3-d]pyrimidin-4-yl)piperazine-1-carboximidamide | CHEMBL565452
TypeSmall organic molecule
Emp. Form.C20H20BrFN8
Mol. Mass.471.329
SMILESC[C@H]1CN(CCN1C(NC#N)=Nc1ccc(F)c(Br)c1)c1ncnc2[nH]cc(C)c12