Reaction Details
TargetLIM domain kinase 2
LigandBDBM50299586
Substrate/Competitorn/a
Meas. Tech.ChEMBL_592392 (CHEMBL1036965)
IC50 1.2±n/a nM
Citation Harrison, BAWhitlock, NAVoronkov, MVAlmstead, ZYGu, KJMabon, RGardyan, MHamman, BDAllen, JGopinathan, SMcKnight, BCrist, MZhang, YLiu, YCourtney, LFKey, BZhou, JPatel, NYates, PWLiu, QWilson, AGKimball, SDCrosson, CERice, DSRawlins, DB Novel class of LIM-kinase 2 inhibitors for the treatment of ocular hypertension and associated glaucoma. J Med Chem52:6515-8 (2009) 
 
LIM domain kinase 2
Name:LIM domain kinase 2
Type:PROTEIN
Mol. Mass.:72238.81
Organism:Homo sapiens (Human)
Description:ChEMBL_1514398
Residue:638
BDBM50299586
NameBDBM50299586
Synonyms:(S)-3-(2-methyl-4-(5-methyl-7H-pyrrolo[2,3-d]pyrimidin-4-yl)piperazine-1-carboxamido)phenyl dimethylcarbamate | CHEMBL570116
TypeSmall organic molecule
Emp. Form.C22H27N7O3
Mol. Mass.437.4949
SMILESC[C@H]1CN(CCN1C(=O)Nc1cccc(OC(=O)N(C)C)c1)c1ncnc2[nH]cc(C)c12