Reaction Details
Target5-hydroxytryptamine receptor 2C
LigandBDBM50301775
Substrate/Competitorn/a
Meas. Tech.ChEMBL_598082 (CHEMBL1049772)
EC50>10000±n/a nM
Citation Andrews, MDGreen, MPAllerton, CMBatchelor, DVBlagg, JBrown, ADGordon, DWMcMurray, GMillns, DJNichols, CLWatson, L Design and synthesis of piperazinylpyrimidinones as novel selective 5-HT(2C) agonists. Bioorg Med Chem Lett19:5346-50 (2009) 
 
5-hydroxytryptamine receptor 2C
Name:5-hydroxytryptamine receptor 2C
Type:G Protein-Coupled Receptor (GPCR)
Mol. Mass.:51836.79
Organism:Homo sapiens (Human)
Description:P28335
Residue:458
BDBM50301775
NameBDBM50301775
Synonyms:3-(3-(3-fluorophenoxy)propyl)-6-methyl-2-(piperazin-1-yl)pyrimidin-4(1H)-one | CHEMBL567168
TypeSmall organic molecule
Emp. Form.C18H23FN4O2
Mol. Mass.346.3992
SMILESCc1cc(=O)n(CCCOc2cccc(F)c2)c(n1)N1CCNCC1