Reaction Details
Target5-hydroxytryptamine receptor 2C
LigandBDBM50301778
Substrate/Competitorn/a
Meas. Tech.ChEMBL_598082 (CHEMBL1049772)
EC50 262±n/a nM
Citation Andrews, MDGreen, MPAllerton, CMBatchelor, DVBlagg, JBrown, ADGordon, DWMcMurray, GMillns, DJNichols, CLWatson, L Design and synthesis of piperazinylpyrimidinones as novel selective 5-HT(2C) agonists. Bioorg Med Chem Lett19:5346-50 (2009) 
 
5-hydroxytryptamine receptor 2C
Name:5-hydroxytryptamine receptor 2C
Type:G Protein-Coupled Receptor (GPCR)
Mol. Mass.:51836.79
Organism:Homo sapiens (Human)
Description:P28335
Residue:458
BDBM50301778
NameBDBM50301778
Synonyms:3-(3-(3-chlorophenoxy)propyl)-6-methyl-2-(piperazin-1-yl)pyrimidin-4(1H)-one | CHEMBL565764
TypeSmall organic molecule
Emp. Form.C18H23ClN4O2
Mol. Mass.362.854
SMILESCc1cc(=O)n(CCCOc2cccc(Cl)c2)c(n1)N1CCNCC1