Reaction Details
Target5-hydroxytryptamine receptor 2C
LigandBDBM50301792
Substrate/Competitorn/a
Meas. Tech.ChEMBL_598082 (CHEMBL1049772)
EC50 73±n/a nM
Citation Andrews, MDGreen, MPAllerton, CMBatchelor, DVBlagg, JBrown, ADGordon, DWMcMurray, GMillns, DJNichols, CLWatson, L Design and synthesis of piperazinylpyrimidinones as novel selective 5-HT(2C) agonists. Bioorg Med Chem Lett19:5346-50 (2009) 
 
5-hydroxytryptamine receptor 2C
Name:5-hydroxytryptamine receptor 2C
Type:G Protein-Coupled Receptor (GPCR)
Mol. Mass.:51836.79
Organism:Homo sapiens (Human)
Description:P28335
Residue:458
BDBM50301792
NameBDBM50301792
Synonyms:2-((2-chlorophenoxy)methyl)-3-methyl-6-(piperazin-1-yl)pyrimidin-4(3H)-one | CHEMBL577619
TypeSmall organic molecule
Emp. Form.C16H19ClN4O2
Mol. Mass.334.801
SMILESCn1c(COc2ccccc2Cl)nc(cc1=O)N1CCNCC1